{"text_format":"1","workbook":"xlsx","n_sheets":4,"sheets":["１ー①選択リスト一覧","１－③申込校一覧","申込者一覧","依頼書"],"not_rendered":{"charts":0,"images":0,"macros":1,"external_links":0,"defined_names":2,"comments":1,"pivot_tables":0},"unopened":[],"bounds":{"document_bytes":16777216,"sheet_cells":100000,"rows_first":2000,"rows_last":500,"rows_between":2000,"halvings":0,"cell_chars":16384,"cell_head_chars":4096},"cells_cut":0,"cells_raw":0,"read":"whole","date_system":"1900"}

{"sheet":"１ー①選択リスト一覧","index":0,"n_rows":23,"n_cols":4,"rows_kept":23,"cut":false,"hidden":false,"merged":[]}
[]
[null,"学科・コース"]
[1,"①","海洋技術コース","操船シミュレーター体験"]
[2,"②","機関コース","マリンエンジンシミュレータ体験"]
[3,"③","栽培工学コース","スキンダイビング体験"]
[4,"④","情報通信科","モールス信号通信体験"]
[5,"⑤","食品工学科","ヨーグルトムースづくり体験"]
[0]
[null,"部活動"]
[null,"A","弓道","A"]
[null,"B","柔道","B"]
[null,"C","剣道","C"]
[null,"D","卓球","D"]
[null,"E","男子バレー","E"]
[null,"F","バドミントン","F"]
[null,"G","サッカー","G"]
[null,"H","野球","H"]
[null,"I","陸上","I"]
[null,"J","サイエンスアクア","J"]
[null,"k","ラーメン同好会","k"]
[null,0,0,0]
[]
[null,null,"希望"]

{"sheet":"１－③申込校一覧","index":1,"n_rows":101,"n_cols":13,"rows_kept":101,"cut":false,"hidden":true,"merged":[]}
["番号","学校番号","中学校名","参加者数","TEL","FAX","担当者","依頼書","区分"]
[1,{"$f":"IFERROR(VLOOKUP($C2,#REF!,7,FALSE),\"\")","v":""},"谷山",5,{"$f":"IFERROR(VLOOKUP($C2,#REF!,4,FALSE),\"\")","v":""},{"$f":"IFERROR(VLOOKUP($C2,#REF!,5,FALSE),\"\")","v":""},"徳田　恵介",null,{"$f":"IFERROR(VLOOKUP($C2,#REF!,6,FALSE),\"\")","v":""},null,"地区","参加校","参加人数"]
[2,{"$f":"IFERROR(VLOOKUP($C3,#REF!,7,FALSE),\"\")","v":""},"天保山",1,{"$f":"IFERROR(VLOOKUP($C3,#REF!,4,FALSE),\"\")","v":""},{"$f":"IFERROR(VLOOKUP($C3,#REF!,5,FALSE),\"\")","v":""},"戸破　亜由美",null,{"$f":"IFERROR(VLOOKUP($C3,#REF!,6,FALSE),\"\")","v":""},null,"Ａ",{"$f":"COUNTIF($I$2:$I$101,\"A\")","v":0},{"$f":"SUMIF($I$2:$I$101,\"A\",$D$2:$D$101)","v":0}]
[3,{"$f":"IFERROR(VLOOKUP($C4,#REF!,7,FALSE),\"\")","v":""},"舞鶴",1,{"$f":"IFERROR(VLOOKUP($C4,#REF!,4,FALSE),\"\")","v":""},{"$f":"IFERROR(VLOOKUP($C4,#REF!,5,FALSE),\"\")","v":""},"荒谷　浩",null,{"$f":"IFERROR(VLOOKUP($C4,#REF!,6,FALSE),\"\")","v":""},null,"Ｂ",{"$f":"COUNTIF($I$2:$I$101,\"B\")","v":0},{"$f":"SUMIF($I$2:$I$101,\"B\",$D$2:$D$101)","v":0}]
[4,{"$f":"IFERROR(VLOOKUP($C5,#REF!,7,FALSE),\"\")","v":""},"武",1,{"$f":"IFERROR(VLOOKUP($C5,#REF!,4,FALSE),\"\")","v":""},{"$f":"IFERROR(VLOOKUP($C5,#REF!,5,FALSE),\"\")","v":""},"中尾　光男",null,{"$f":"IFERROR(VLOOKUP($C5,#REF!,6,FALSE),\"\")","v":""},null,"Ｃ",{"$f":"COUNTIF($I$2:$I$101,\"C\")","v":0},{"$f":"SUMIF($I$2:$I$101,\"C\",$D$2:$D$101)","v":0}]
[5,{"$f":"IFERROR(VLOOKUP($C6,#REF!,7,FALSE),\"\")","v":""},"串木野",1,{"$f":"IFERROR(VLOOKUP($C6,#REF!,4,FALSE),\"\")","v":""},{"$f":"IFERROR(VLOOKUP($C6,#REF!,5,FALSE),\"\")","v":""},"中園　透",null,{"$f":"IFERROR(VLOOKUP($C6,#REF!,6,FALSE),\"\")","v":""},null,"Ｄ",{"$f":"COUNTIF($I$2:$I$101,\"D\")","v":0},{"$f":"SUMIF($I$2:$I$101,\"D\",$D$2:$D$101)","v":0}]
[6,{"$f":"IFERROR(VLOOKUP($C7,#REF!,7,FALSE),\"\")","v":""},"名瀬",1,{"$f":"IFERROR(VLOOKUP($C7,#REF!,4,FALSE),\"\")","v":""},{"$f":"IFERROR(VLOOKUP($C7,#REF!,5,FALSE),\"\")","v":""},"通山　満理子",null,{"$f":"IFERROR(VLOOKUP($C7,#REF!,6,FALSE),\"\")","v":""},null,"Ｅ",{"$f":"COUNTIF($I$2:$I$101,\"E\")","v":0},{"$f":"SUMIF($I$2:$I$101,\"E\",$D$2:$D$101)","v":0}]
[7,{"$f":"IFERROR(VLOOKUP($C8,#REF!,7,FALSE),\"\")","v":""},"花岡",1,{"$f":"IFERROR(VLOOKUP($C8,#REF!,4,FALSE),\"\")","v":""},{"$f":"IFERROR(VLOOKUP($C8,#REF!,5,FALSE),\"\")","v":""},"徳丸　政治",null,{"$f":"IFERROR(VLOOKUP($C8,#REF!,6,FALSE),\"\")","v":""},null,"Ｆ",{"$f":"COUNTIF($I$2:$I$101,\"F\")","v":0},{"$f":"SUMIF($I$2:$I$101,\"F\",$D$2:$D$101)","v":0}]
[8,{"$f":"IFERROR(VLOOKUP($C9,#REF!,7,FALSE),\"\")","v":""},"日吉学園",1,{"$f":"IFERROR(VLOOKUP($C9,#REF!,4,FALSE),\"\")","v":""},{"$f":"IFERROR(VLOOKUP($C9,#REF!,5,FALSE),\"\")","v":""},"満尾　竜一",null,{"$f":"IFERROR(VLOOKUP($C9,#REF!,6,FALSE),\"\")","v":""}]
[9,{"$f":"IFERROR(VLOOKUP($C10,#REF!,7,FALSE),\"\")","v":""},"帖佐",2,{"$f":"IFERROR(VLOOKUP($C10,#REF!,4,FALSE),\"\")","v":""},{"$f":"IFERROR(VLOOKUP($C10,#REF!,5,FALSE),\"\")","v":""},"濱田　忠幸",null,{"$f":"IFERROR(VLOOKUP($C10,#REF!,6,FALSE),\"\")","v":""}]
[10,{"$f":"IFERROR(VLOOKUP($C11,#REF!,7,FALSE),\"\")","v":""},"川内中央",1,{"$f":"IFERROR(VLOOKUP($C11,#REF!,4,FALSE),\"\")","v":""},{"$f":"IFERROR(VLOOKUP($C11,#REF!,5,FALSE),\"\")","v":""},"上栗　博文",null,{"$f":"IFERROR(VLOOKUP($C11,#REF!,6,FALSE),\"\")","v":""}]
[11,{"$f":"IFERROR(VLOOKUP($C12,#REF!,7,FALSE),\"\")","v":""},"伊﨑田",2,{"$f":"IFERROR(VLOOKUP($C12,#REF!,4,FALSE),\"\")","v":""},{"$f":"IFERROR(VLOOKUP($C12,#REF!,5,FALSE),\"\")","v":""},"春田　直行",null,{"$f":"IFERROR(VLOOKUP($C12,#REF!,6,FALSE),\"\")","v":""}]
[12,{"$f":"IFERROR(VLOOKUP($C13,#REF!,7,FALSE),\"\")","v":""},"明和",1,{"$f":"IFERROR(VLOOKUP($C13,#REF!,4,FALSE),\"\")","v":""},{"$f":"IFERROR(VLOOKUP($C13,#REF!,5,FALSE),\"\")","v":""},"福嶋　淳哉",null,{"$f":"IFERROR(VLOOKUP($C13,#REF!,6,FALSE),\"\")","v":""}]
[13,{"$f":"IFERROR(VLOOKUP($C14,#REF!,7,FALSE),\"\")","v":""},"松元",1,{"$f":"IFERROR(VLOOKUP($C14,#REF!,4,FALSE),\"\")","v":""},{"$f":"IFERROR(VLOOKUP($C14,#REF!,5,FALSE),\"\")","v":""},"内村　芳樹",null,{"$f":"IFERROR(VLOOKUP($C14,#REF!,6,FALSE),\"\")","v":""}]
[14,{"$f":"IFERROR(VLOOKUP($C15,#REF!,7,FALSE),\"\")","v":""},"山川",4,{"$f":"IFERROR(VLOOKUP($C15,#REF!,4,FALSE),\"\")","v":""},{"$f":"IFERROR(VLOOKUP($C15,#REF!,5,FALSE),\"\")","v":""},"朝野　由也",null,{"$f":"IFERROR(VLOOKUP($C15,#REF!,6,FALSE),\"\")","v":""}]
[15,{"$f":"IFERROR(VLOOKUP($C16,#REF!,7,FALSE),\"\")","v":""},"坊津学園",14,{"$f":"IFERROR(VLOOKUP($C16,#REF!,4,FALSE),\"\")","v":""},{"$f":"IFERROR(VLOOKUP($C16,#REF!,5,FALSE),\"\")","v":""},"三宅　志保",null,{"$f":"IFERROR(VLOOKUP($C16,#REF!,6,FALSE),\"\")","v":""}]
[16,{"$f":"IFERROR(VLOOKUP($C17,#REF!,7,FALSE),\"\")","v":""},"吉野",2,{"$f":"IFERROR(VLOOKUP($C17,#REF!,4,FALSE),\"\")","v":""},{"$f":"IFERROR(VLOOKUP($C17,#REF!,5,FALSE),\"\")","v":""},"重岡　有",null,{"$f":"IFERROR(VLOOKUP($C17,#REF!,6,FALSE),\"\")","v":""}]
[17,{"$f":"IFERROR(VLOOKUP($C18,#REF!,7,FALSE),\"\")","v":""},"立神",9,{"$f":"IFERROR(VLOOKUP($C18,#REF!,4,FALSE),\"\")","v":""},{"$f":"IFERROR(VLOOKUP($C18,#REF!,5,FALSE),\"\")","v":""},"山口　広海",null,{"$f":"IFERROR(VLOOKUP($C18,#REF!,6,FALSE),\"\")","v":""}]
[18,{"$f":"IFERROR(VLOOKUP($C19,#REF!,7,FALSE),\"\")","v":""},"田崎",2,{"$f":"IFERROR(VLOOKUP($C19,#REF!,4,FALSE),\"\")","v":""},{"$f":"IFERROR(VLOOKUP($C19,#REF!,5,FALSE),\"\")","v":""},"柏原　龍哉",null,{"$f":"IFERROR(VLOOKUP($C19,#REF!,6,FALSE),\"\")","v":""}]
[19,{"$f":"IFERROR(VLOOKUP($C20,#REF!,7,FALSE),\"\")","v":""},"川内南",1,{"$f":"IFERROR(VLOOKUP($C20,#REF!,4,FALSE),\"\")","v":""},{"$f":"IFERROR(VLOOKUP($C20,#REF!,5,FALSE),\"\")","v":""},"沖洲　公一",null,{"$f":"IFERROR(VLOOKUP($C20,#REF!,6,FALSE),\"\")","v":""}]
[20,{"$f":"IFERROR(VLOOKUP($C21,#REF!,7,FALSE),\"\")","v":""},"古仁屋",2,{"$f":"IFERROR(VLOOKUP($C21,#REF!,4,FALSE),\"\")","v":""},{"$f":"IFERROR(VLOOKUP($C21,#REF!,5,FALSE),\"\")","v":""},"西　香穂美",null,{"$f":"IFERROR(VLOOKUP($C21,#REF!,6,FALSE),\"\")","v":""}]
[21,{"$f":"IFERROR(VLOOKUP($C22,#REF!,7,FALSE),\"\")","v":""},"和田",4,{"$f":"IFERROR(VLOOKUP($C22,#REF!,4,FALSE),\"\")","v":""},{"$f":"IFERROR(VLOOKUP($C22,#REF!,5,FALSE),\"\")","v":""},"二木　直志",null,{"$f":"IFERROR(VLOOKUP($C22,#REF!,6,FALSE),\"\")","v":""}]
[22,{"$f":"IFERROR(VLOOKUP($C23,#REF!,7,FALSE),\"\")","v":""},"鷹巣",1,{"$f":"IFERROR(VLOOKUP($C23,#REF!,4,FALSE),\"\")","v":""},{"$f":"IFERROR(VLOOKUP($C23,#REF!,5,FALSE),\"\")","v":""},"花木　隆一",null,{"$f":"IFERROR(VLOOKUP($C23,#REF!,6,FALSE),\"\")","v":""}]
[23,{"$f":"IFERROR(VLOOKUP($C24,#REF!,7,FALSE),\"\")","v":""},"別府",7,{"$f":"IFERROR(VLOOKUP($C24,#REF!,4,FALSE),\"\")","v":""},{"$f":"IFERROR(VLOOKUP($C24,#REF!,5,FALSE),\"\")","v":""},"鮫島　志津香",null,{"$f":"IFERROR(VLOOKUP($C24,#REF!,6,FALSE),\"\")","v":""}]
[24,{"$f":"IFERROR(VLOOKUP($C25,#REF!,7,FALSE),\"\")","v":""},"甲南",1,{"$f":"IFERROR(VLOOKUP($C25,#REF!,4,FALSE),\"\")","v":""},{"$f":"IFERROR(VLOOKUP($C25,#REF!,5,FALSE),\"\")","v":""},"秋丸　真一",null,{"$f":"IFERROR(VLOOKUP($C25,#REF!,6,FALSE),\"\")","v":""}]
[25,{"$f":"IFERROR(VLOOKUP($C26,#REF!,7,FALSE),\"\")","v":""},"皇徳寺",1,{"$f":"IFERROR(VLOOKUP($C26,#REF!,4,FALSE),\"\")","v":""},{"$f":"IFERROR(VLOOKUP($C26,#REF!,5,FALSE),\"\")","v":""},"下里　美保子",null,{"$f":"IFERROR(VLOOKUP($C26,#REF!,6,FALSE),\"\")","v":""}]
[26,{"$f":"IFERROR(VLOOKUP($C27,#REF!,7,FALSE),\"\")","v":""},"米ノ津",1,{"$f":"IFERROR(VLOOKUP($C27,#REF!,4,FALSE),\"\")","v":""},{"$f":"IFERROR(VLOOKUP($C27,#REF!,5,FALSE),\"\")","v":""},"小田　雄一郎",null,{"$f":"IFERROR(VLOOKUP($C27,#REF!,6,FALSE),\"\")","v":""}]
[27,{"$f":"IFERROR(VLOOKUP($C28,#REF!,7,FALSE),\"\")","v":""},"喜界",1,{"$f":"IFERROR(VLOOKUP($C28,#REF!,4,FALSE),\"\")","v":""},{"$f":"IFERROR(VLOOKUP($C28,#REF!,5,FALSE),\"\")","v":""},"大塚　幸子",null,{"$f":"IFERROR(VLOOKUP($C28,#REF!,6,FALSE),\"\")","v":""}]
[28,{"$f":"IFERROR(VLOOKUP($C29,#REF!,7,FALSE),\"\")","v":""},"緑丘",2,{"$f":"IFERROR(VLOOKUP($C29,#REF!,4,FALSE),\"\")","v":""},{"$f":"IFERROR(VLOOKUP($C29,#REF!,5,FALSE),\"\")","v":""},"西　正悟",null,{"$f":"IFERROR(VLOOKUP($C29,#REF!,6,FALSE),\"\")","v":""}]
[29,{"$f":"IFERROR(VLOOKUP($C30,#REF!,7,FALSE),\"\")","v":""},"知覧",15,{"$f":"IFERROR(VLOOKUP($C30,#REF!,4,FALSE),\"\")","v":""},{"$f":"IFERROR(VLOOKUP($C30,#REF!,5,FALSE),\"\")","v":""},"上床　美鈴",null,{"$f":"IFERROR(VLOOKUP($C30,#REF!,6,FALSE),\"\")","v":""}]
[30,{"$f":"IFERROR(VLOOKUP($C31,#REF!,7,FALSE),\"\")","v":""},"隼人",1,{"$f":"IFERROR(VLOOKUP($C31,#REF!,4,FALSE),\"\")","v":""},{"$f":"IFERROR(VLOOKUP($C31,#REF!,5,FALSE),\"\")","v":""},"四ッ永　美幸",null,{"$f":"IFERROR(VLOOKUP($C31,#REF!,6,FALSE),\"\")","v":""}]
[31,{"$f":"IFERROR(VLOOKUP($C32,#REF!,7,FALSE),\"\")","v":""},"加治木",2,{"$f":"IFERROR(VLOOKUP($C32,#REF!,4,FALSE),\"\")","v":""},{"$f":"IFERROR(VLOOKUP($C32,#REF!,5,FALSE),\"\")","v":""},"吉永　達也",null,{"$f":"IFERROR(VLOOKUP($C32,#REF!,6,FALSE),\"\")","v":""}]
[32,{"$f":"IFERROR(VLOOKUP($C33,#REF!,7,FALSE),\"\")","v":""},"吉田南",1,{"$f":"IFERROR(VLOOKUP($C33,#REF!,4,FALSE),\"\")","v":""},{"$f":"IFERROR(VLOOKUP($C33,#REF!,5,FALSE),\"\")","v":""},"松山　健太郎",null,{"$f":"IFERROR(VLOOKUP($C33,#REF!,6,FALSE),\"\")","v":""}]
[33,{"$f":"IFERROR(VLOOKUP($C34,#REF!,7,FALSE),\"\")","v":""},"里",1,{"$f":"IFERROR(VLOOKUP($C34,#REF!,4,FALSE),\"\")","v":""},{"$f":"IFERROR(VLOOKUP($C34,#REF!,5,FALSE),\"\")","v":""},"久保園　修子",null,{"$f":"IFERROR(VLOOKUP($C34,#REF!,6,FALSE),\"\")","v":""}]
[34,{"$f":"IFERROR(VLOOKUP($C35,#REF!,7,FALSE),\"\")","v":""},"吉野東",3,{"$f":"IFERROR(VLOOKUP($C35,#REF!,4,FALSE),\"\")","v":""},{"$f":"IFERROR(VLOOKUP($C35,#REF!,5,FALSE),\"\")","v":""},"山下　修",null,{"$f":"IFERROR(VLOOKUP($C35,#REF!,6,FALSE),\"\")","v":""}]
[35,{"$f":"IFERROR(VLOOKUP($C36,#REF!,7,FALSE),\"\")","v":""},"金峰学園",3,{"$f":"IFERROR(VLOOKUP($C36,#REF!,4,FALSE),\"\")","v":""},{"$f":"IFERROR(VLOOKUP($C36,#REF!,5,FALSE),\"\")","v":""},"熊迫　かほる",null,{"$f":"IFERROR(VLOOKUP($C36,#REF!,6,FALSE),\"\")","v":""}]
[36,{"$f":"IFERROR(VLOOKUP($C37,#REF!,7,FALSE),\"\")","v":""},"喜入",1,{"$f":"IFERROR(VLOOKUP($C37,#REF!,4,FALSE),\"\")","v":""},{"$f":"IFERROR(VLOOKUP($C37,#REF!,5,FALSE),\"\")","v":""},"堀　祐二郎",null,{"$f":"IFERROR(VLOOKUP($C37,#REF!,6,FALSE),\"\")","v":""}]
[37,{"$f":"IFERROR(VLOOKUP($C38,#REF!,7,FALSE),\"\")","v":""},"安房",1,{"$f":"IFERROR(VLOOKUP($C38,#REF!,4,FALSE),\"\")","v":""},{"$f":"IFERROR(VLOOKUP($C38,#REF!,5,FALSE),\"\")","v":""},"小野原　雅啓",null,{"$f":"IFERROR(VLOOKUP($C38,#REF!,6,FALSE),\"\")","v":""}]
[38,{"$f":"IFERROR(VLOOKUP($C39,#REF!,7,FALSE),\"\")","v":""},"万世",4,{"$f":"IFERROR(VLOOKUP($C39,#REF!,4,FALSE),\"\")","v":""},{"$f":"IFERROR(VLOOKUP($C39,#REF!,5,FALSE),\"\")","v":""},"肱岡　亜衣子",null,{"$f":"IFERROR(VLOOKUP($C39,#REF!,6,FALSE),\"\")","v":""}]
[39,{"$f":"IFERROR(VLOOKUP($C40,#REF!,7,FALSE),\"\")","v":""},"桜島",1,{"$f":"IFERROR(VLOOKUP($C40,#REF!,4,FALSE),\"\")","v":""},{"$f":"IFERROR(VLOOKUP($C40,#REF!,5,FALSE),\"\")","v":""},"屋久　悦子",null,{"$f":"IFERROR(VLOOKUP($C40,#REF!,6,FALSE),\"\")","v":""}]
[40,{"$f":"IFERROR(VLOOKUP($C41,#REF!,7,FALSE),\"\")","v":""},"谷山北",2,{"$f":"IFERROR(VLOOKUP($C41,#REF!,4,FALSE),\"\")","v":""},{"$f":"IFERROR(VLOOKUP($C41,#REF!,5,FALSE),\"\")","v":""},"中江　健一",null,{"$f":"IFERROR(VLOOKUP($C41,#REF!,6,FALSE),\"\")","v":""}]
[41,{"$f":"IFERROR(VLOOKUP($C42,#REF!,7,FALSE),\"\")","v":""},"高尾野",1,{"$f":"IFERROR(VLOOKUP($C42,#REF!,4,FALSE),\"\")","v":""},{"$f":"IFERROR(VLOOKUP($C42,#REF!,5,FALSE),\"\")","v":""},"西郷　耕平",null,{"$f":"IFERROR(VLOOKUP($C42,#REF!,6,FALSE),\"\")","v":""}]
[42,{"$f":"IFERROR(VLOOKUP($C43,#REF!,7,FALSE),\"\")","v":""},"東谷山",1,{"$f":"IFERROR(VLOOKUP($C43,#REF!,4,FALSE),\"\")","v":""},{"$f":"IFERROR(VLOOKUP($C43,#REF!,5,FALSE),\"\")","v":""},"山口　卓洋",null,{"$f":"IFERROR(VLOOKUP($C43,#REF!,6,FALSE),\"\")","v":""}]
[43,{"$f":"IFERROR(VLOOKUP($C44,#REF!,7,FALSE),\"\")","v":""},"大笠",1,{"$f":"IFERROR(VLOOKUP($C44,#REF!,4,FALSE),\"\")","v":""},{"$f":"IFERROR(VLOOKUP($C44,#REF!,5,FALSE),\"\")","v":""},"宮内　幸雄",null,{"$f":"IFERROR(VLOOKUP($C44,#REF!,6,FALSE),\"\")","v":""}]
[44,{"$f":"IFERROR(VLOOKUP($C45,#REF!,7,FALSE),\"\")","v":""},"坂元",1,{"$f":"IFERROR(VLOOKUP($C45,#REF!,4,FALSE),\"\")","v":""},{"$f":"IFERROR(VLOOKUP($C45,#REF!,5,FALSE),\"\")","v":""},"中園　武志",null,{"$f":"IFERROR(VLOOKUP($C45,#REF!,6,FALSE),\"\")","v":""}]
[45,{"$f":"IFERROR(VLOOKUP($C46,#REF!,7,FALSE),\"\")","v":""},"吹上",3,{"$f":"IFERROR(VLOOKUP($C46,#REF!,4,FALSE),\"\")","v":""},{"$f":"IFERROR(VLOOKUP($C46,#REF!,5,FALSE),\"\")","v":""},"松山　美乃里",null,{"$f":"IFERROR(VLOOKUP($C46,#REF!,6,FALSE),\"\")","v":""}]
[46,{"$f":"IFERROR(VLOOKUP($C47,#REF!,7,FALSE),\"\")","v":""},"鹿児島大学教育学部付属",1,{"$f":"IFERROR(VLOOKUP($C47,#REF!,4,FALSE),\"\")","v":""},{"$f":"IFERROR(VLOOKUP($C47,#REF!,5,FALSE),\"\")","v":""},"牧　俊輔",null,{"$f":"IFERROR(VLOOKUP($C47,#REF!,6,FALSE),\"\")","v":""}]
[47,{"$f":"IFERROR(VLOOKUP($C48,#REF!,7,FALSE),\"\")","v":""},"頴娃",22,{"$f":"IFERROR(VLOOKUP($C48,#REF!,4,FALSE),\"\")","v":""},{"$f":"IFERROR(VLOOKUP($C48,#REF!,5,FALSE),\"\")","v":""},"藤岡　佑季子",null,{"$f":"IFERROR(VLOOKUP($C48,#REF!,6,FALSE),\"\")","v":""}]
[48,{"$f":"IFERROR(VLOOKUP($C49,#REF!,7,FALSE),\"\")","v":""},"福平",3,{"$f":"IFERROR(VLOOKUP($C49,#REF!,4,FALSE),\"\")","v":""},{"$f":"IFERROR(VLOOKUP($C49,#REF!,5,FALSE),\"\")","v":""},"黒田　雅子",null,{"$f":"IFERROR(VLOOKUP($C49,#REF!,6,FALSE),\"\")","v":""}]
[49,{"$f":"IFERROR(VLOOKUP($C50,#REF!,7,FALSE),\"\")","v":""},"枕崎",14,{"$f":"IFERROR(VLOOKUP($C50,#REF!,4,FALSE),\"\")","v":""},{"$f":"IFERROR(VLOOKUP($C50,#REF!,5,FALSE),\"\")","v":""},"川添　亜矢子",null,{"$f":"IFERROR(VLOOKUP($C50,#REF!,6,FALSE),\"\")","v":""}]
[50,{"$f":"IFERROR(VLOOKUP($C51,#REF!,7,FALSE),\"\")","v":""},"北指宿",3,{"$f":"IFERROR(VLOOKUP($C51,#REF!,4,FALSE),\"\")","v":""},{"$f":"IFERROR(VLOOKUP($C51,#REF!,5,FALSE),\"\")","v":""},"税所　賢太郎",null,{"$f":"IFERROR(VLOOKUP($C51,#REF!,6,FALSE),\"\")","v":""}]
[51,{"$f":"IFERROR(VLOOKUP($C52,#REF!,7,FALSE),\"\")","v":""},"加世田",9,{"$f":"IFERROR(VLOOKUP($C52,#REF!,4,FALSE),\"\")","v":""},{"$f":"IFERROR(VLOOKUP($C52,#REF!,5,FALSE),\"\")","v":""},"有馬　寛",null,{"$f":"IFERROR(VLOOKUP($C52,#REF!,6,FALSE),\"\")","v":""}]
[52,{"$f":"IFERROR(VLOOKUP($C53,#REF!,7,FALSE),\"\")","v":""},"桜山",7,{"$f":"IFERROR(VLOOKUP($C53,#REF!,4,FALSE),\"\")","v":""},{"$f":"IFERROR(VLOOKUP($C53,#REF!,5,FALSE),\"\")","v":""},"田中　ゆかり",null,{"$f":"IFERROR(VLOOKUP($C53,#REF!,6,FALSE),\"\")","v":""}]
[53,{"$f":"IFERROR(VLOOKUP($C54,#REF!,7,FALSE),\"\")","v":""},"南種子",3,{"$f":"IFERROR(VLOOKUP($C54,#REF!,4,FALSE),\"\")","v":""},{"$f":"IFERROR(VLOOKUP($C54,#REF!,5,FALSE),\"\")","v":""},"萬屋　郁",null,{"$f":"IFERROR(VLOOKUP($C54,#REF!,6,FALSE),\"\")","v":""}]
[54,{"$f":"IFERROR(VLOOKUP($C55,#REF!,7,FALSE),\"\")","v":""},"川辺",19,{"$f":"IFERROR(VLOOKUP($C55,#REF!,4,FALSE),\"\")","v":""},{"$f":"IFERROR(VLOOKUP($C55,#REF!,5,FALSE),\"\")","v":""},"川野　耕平",null,{"$f":"IFERROR(VLOOKUP($C55,#REF!,6,FALSE),\"\")","v":""}]
[55,{"$f":"IFERROR(VLOOKUP($C56,#REF!,7,FALSE),\"\")","v":""},"えびの市立飯野",1,{"$f":"IFERROR(VLOOKUP($C56,#REF!,4,FALSE),\"\")","v":""},{"$f":"IFERROR(VLOOKUP($C56,#REF!,5,FALSE),\"\")","v":""},"阿蘇品",null,{"$f":"IFERROR(VLOOKUP($C56,#REF!,6,FALSE),\"\")","v":""}]
[56,{"$f":"IFERROR(VLOOKUP($C57,#REF!,7,FALSE),\"\")","v":""},null,null,{"$f":"IFERROR(VLOOKUP($C57,#REF!,4,FALSE),\"\")","v":""},{"$f":"IFERROR(VLOOKUP($C57,#REF!,5,FALSE),\"\")","v":""},null,null,{"$f":"IFERROR(VLOOKUP($C57,#REF!,6,FALSE),\"\")","v":""}]
[57,{"$f":"IFERROR(VLOOKUP($C58,#REF!,7,FALSE),\"\")","v":""},null,null,{"$f":"IFERROR(VLOOKUP($C58,#REF!,4,FALSE),\"\")","v":""},{"$f":"IFERROR(VLOOKUP($C58,#REF!,5,FALSE),\"\")","v":""},null,null,{"$f":"IFERROR(VLOOKUP($C58,#REF!,6,FALSE),\"\")","v":""}]
[58,{"$f":"IFERROR(VLOOKUP($C59,#REF!,7,FALSE),\"\")","v":""},null,null,{"$f":"IFERROR(VLOOKUP($C59,#REF!,4,FALSE),\"\")","v":""},{"$f":"IFERROR(VLOOKUP($C59,#REF!,5,FALSE),\"\")","v":""},null,null,{"$f":"IFERROR(VLOOKUP($C59,#REF!,6,FALSE),\"\")","v":""}]
[59,{"$f":"IFERROR(VLOOKUP($C60,#REF!,7,FALSE),\"\")","v":""},null,null,{"$f":"IFERROR(VLOOKUP($C60,#REF!,4,FALSE),\"\")","v":""},{"$f":"IFERROR(VLOOKUP($C60,#REF!,5,FALSE),\"\")","v":""},null,null,{"$f":"IFERROR(VLOOKUP($C60,#REF!,6,FALSE),\"\")","v":""}]
[60,{"$f":"IFERROR(VLOOKUP($C61,#REF!,7,FALSE),\"\")","v":""},null,null,{"$f":"IFERROR(VLOOKUP($C61,#REF!,4,FALSE),\"\")","v":""},{"$f":"IFERROR(VLOOKUP($C61,#REF!,5,FALSE),\"\")","v":""},null,null,{"$f":"IFERROR(VLOOKUP($C61,#REF!,6,FALSE),\"\")","v":""}]
[61,{"$f":"IFERROR(VLOOKUP($C62,#REF!,7,FALSE),\"\")","v":""},null,null,{"$f":"IFERROR(VLOOKUP($C62,#REF!,4,FALSE),\"\")","v":""},{"$f":"IFERROR(VLOOKUP($C62,#REF!,5,FALSE),\"\")","v":""},null,null,{"$f":"IFERROR(VLOOKUP($C62,#REF!,6,FALSE),\"\")","v":""}]
[62,{"$f":"IFERROR(VLOOKUP($C63,#REF!,7,FALSE),\"\")","v":""},null,null,{"$f":"IFERROR(VLOOKUP($C63,#REF!,4,FALSE),\"\")","v":""},{"$f":"IFERROR(VLOOKUP($C63,#REF!,5,FALSE),\"\")","v":""},null,null,{"$f":"IFERROR(VLOOKUP($C63,#REF!,6,FALSE),\"\")","v":""}]
[63,{"$f":"IFERROR(VLOOKUP($C64,#REF!,7,FALSE),\"\")","v":""},null,null,{"$f":"IFERROR(VLOOKUP($C64,#REF!,4,FALSE),\"\")","v":""},{"$f":"IFERROR(VLOOKUP($C64,#REF!,5,FALSE),\"\")","v":""},null,null,{"$f":"IFERROR(VLOOKUP($C64,#REF!,6,FALSE),\"\")","v":""}]
[64,{"$f":"IFERROR(VLOOKUP($C65,#REF!,7,FALSE),\"\")","v":""},null,null,{"$f":"IFERROR(VLOOKUP($C65,#REF!,4,FALSE),\"\")","v":""},{"$f":"IFERROR(VLOOKUP($C65,#REF!,5,FALSE),\"\")","v":""},null,null,{"$f":"IFERROR(VLOOKUP($C65,#REF!,6,FALSE),\"\")","v":""}]
[65,{"$f":"IFERROR(VLOOKUP($C66,#REF!,7,FALSE),\"\")","v":""},null,null,{"$f":"IFERROR(VLOOKUP($C66,#REF!,4,FALSE),\"\")","v":""},{"$f":"IFERROR(VLOOKUP($C66,#REF!,5,FALSE),\"\")","v":""},null,null,{"$f":"IFERROR(VLOOKUP($C66,#REF!,6,FALSE),\"\")","v":""}]
[66,{"$f":"IFERROR(VLOOKUP($C67,#REF!,7,FALSE),\"\")","v":""},null,null,{"$f":"IFERROR(VLOOKUP($C67,#REF!,4,FALSE),\"\")","v":""},{"$f":"IFERROR(VLOOKUP($C67,#REF!,5,FALSE),\"\")","v":""},null,null,{"$f":"IFERROR(VLOOKUP($C67,#REF!,6,FALSE),\"\")","v":""}]
[67,{"$f":"IFERROR(VLOOKUP($C68,#REF!,7,FALSE),\"\")","v":""},null,null,{"$f":"IFERROR(VLOOKUP($C68,#REF!,4,FALSE),\"\")","v":""},{"$f":"IFERROR(VLOOKUP($C68,#REF!,5,FALSE),\"\")","v":""},null,null,{"$f":"IFERROR(VLOOKUP($C68,#REF!,6,FALSE),\"\")","v":""}]
[68,{"$f":"IFERROR(VLOOKUP($C69,#REF!,7,FALSE),\"\")","v":""},null,null,{"$f":"IFERROR(VLOOKUP($C69,#REF!,4,FALSE),\"\")","v":""},{"$f":"IFERROR(VLOOKUP($C69,#REF!,5,FALSE),\"\")","v":""},null,null,{"$f":"IFERROR(VLOOKUP($C69,#REF!,6,FALSE),\"\")","v":""}]
[69,{"$f":"IFERROR(VLOOKUP($C70,#REF!,7,FALSE),\"\")","v":""},null,null,{"$f":"IFERROR(VLOOKUP($C70,#REF!,4,FALSE),\"\")","v":""},{"$f":"IFERROR(VLOOKUP($C70,#REF!,5,FALSE),\"\")","v":""},null,null,{"$f":"IFERROR(VLOOKUP($C70,#REF!,6,FALSE),\"\")","v":""}]
[70,{"$f":"IFERROR(VLOOKUP($C71,#REF!,7,FALSE),\"\")","v":""},null,null,{"$f":"IFERROR(VLOOKUP($C71,#REF!,4,FALSE),\"\")","v":""},{"$f":"IFERROR(VLOOKUP($C71,#REF!,5,FALSE),\"\")","v":""},null,null,{"$f":"IFERROR(VLOOKUP($C71,#REF!,6,FALSE),\"\")","v":""}]
[71,{"$f":"IFERROR(VLOOKUP($C72,#REF!,7,FALSE),\"\")","v":""},null,null,{"$f":"IFERROR(VLOOKUP($C72,#REF!,4,FALSE),\"\")","v":""},{"$f":"IFERROR(VLOOKUP($C72,#REF!,5,FALSE),\"\")","v":""},null,null,{"$f":"IFERROR(VLOOKUP($C72,#REF!,6,FALSE),\"\")","v":""}]
[72,{"$f":"IFERROR(VLOOKUP($C73,#REF!,7,FALSE),\"\")","v":""},null,null,{"$f":"IFERROR(VLOOKUP($C73,#REF!,4,FALSE),\"\")","v":""},{"$f":"IFERROR(VLOOKUP($C73,#REF!,5,FALSE),\"\")","v":""},null,null,{"$f":"IFERROR(VLOOKUP($C73,#REF!,6,FALSE),\"\")","v":""}]
[73,{"$f":"IFERROR(VLOOKUP($C74,#REF!,7,FALSE),\"\")","v":""},null,null,{"$f":"IFERROR(VLOOKUP($C74,#REF!,4,FALSE),\"\")","v":""},{"$f":"IFERROR(VLOOKUP($C74,#REF!,5,FALSE),\"\")","v":""},null,null,{"$f":"IFERROR(VLOOKUP($C74,#REF!,6,FALSE),\"\")","v":""}]
[74,{"$f":"IFERROR(VLOOKUP($C75,#REF!,7,FALSE),\"\")","v":""},null,null,{"$f":"IFERROR(VLOOKUP($C75,#REF!,4,FALSE),\"\")","v":""},{"$f":"IFERROR(VLOOKUP($C75,#REF!,5,FALSE),\"\")","v":""},null,null,{"$f":"IFERROR(VLOOKUP($C75,#REF!,6,FALSE),\"\")","v":""}]
[75,{"$f":"IFERROR(VLOOKUP($C76,#REF!,7,FALSE),\"\")","v":""},null,null,{"$f":"IFERROR(VLOOKUP($C76,#REF!,4,FALSE),\"\")","v":""},{"$f":"IFERROR(VLOOKUP($C76,#REF!,5,FALSE),\"\")","v":""},null,null,{"$f":"IFERROR(VLOOKUP($C76,#REF!,6,FALSE),\"\")","v":""}]
[76,{"$f":"IFERROR(VLOOKUP($C77,#REF!,7,FALSE),\"\")","v":""},null,null,{"$f":"IFERROR(VLOOKUP($C77,#REF!,4,FALSE),\"\")","v":""},{"$f":"IFERROR(VLOOKUP($C77,#REF!,5,FALSE),\"\")","v":""},null,null,{"$f":"IFERROR(VLOOKUP($C77,#REF!,6,FALSE),\"\")","v":""}]
[77,{"$f":"IFERROR(VLOOKUP($C78,#REF!,7,FALSE),\"\")","v":""},null,null,{"$f":"IFERROR(VLOOKUP($C78,#REF!,4,FALSE),\"\")","v":""},{"$f":"IFERROR(VLOOKUP($C78,#REF!,5,FALSE),\"\")","v":""},null,null,{"$f":"IFERROR(VLOOKUP($C78,#REF!,6,FALSE),\"\")","v":""}]
[78,{"$f":"IFERROR(VLOOKUP($C79,#REF!,7,FALSE),\"\")","v":""},null,null,{"$f":"IFERROR(VLOOKUP($C79,#REF!,4,FALSE),\"\")","v":""},{"$f":"IFERROR(VLOOKUP($C79,#REF!,5,FALSE),\"\")","v":""},null,null,{"$f":"IFERROR(VLOOKUP($C79,#REF!,6,FALSE),\"\")","v":""}]
[79,{"$f":"IFERROR(VLOOKUP($C80,#REF!,7,FALSE),\"\")","v":""},null,null,{"$f":"IFERROR(VLOOKUP($C80,#REF!,4,FALSE),\"\")","v":""},{"$f":"IFERROR(VLOOKUP($C80,#REF!,5,FALSE),\"\")","v":""},null,null,{"$f":"IFERROR(VLOOKUP($C80,#REF!,6,FALSE),\"\")","v":""}]
{"$rows_left_out":22}
{"sheet":"申込者一覧","index":2,"n_rows":47,"n_cols":14,"rows_kept":47,"cut":false,"hidden":false,"merged":[[0,8,0,10],[1,0,1,10],[5,3,5,5],[5,8,5,10],[3,3,3,4],[3,8,3,10]]}
[null,null,null,null,null,null,null,null,"（一日体験入学）様式2"]
["一日体験入学申込書"]
[]
[null,null,"学校名",null,null,"中学校",null,"担当者"]
[]
[null,null,"ＴＥＬ",null,null,null,null,"ＦＡＸ"]
[]
["No","保護者\n同意書","学年","氏　　名","ふりがな","8月6日","8月7日","第1希望","第2希望","第3希望","部活動",null,null,"希望コース"]
["例１","○","３年","水産　太郎","すいさん　たろう",1,"2",1,2,3,"C",null,1,"海洋技術コース"]
["例２","○","２年","水産　花子","すいさん　はなこ","2","1",5,3,2,null,null,2,"機関コース"]
["例３","○","１年","水産　虎太郎","すいさん　こたろう","2","1",4,5,2,"G",null,3,"栽培工学コース"]
[1,null,null,null,null,null,null,null,null,null,null,null,4,"情報通信科"]
[2,null,null,null,null,null,null,null,null,null,null,null,5,"食品工学科"]
[3]
[4,null,null,null,null,null,null,null,null,null,null,null,null,"部活"]
[5,null,null,null,null,null,null,null,null,null,null,null,{"$f":"'１ー①選択リスト一覧'!B10","v":"A"},{"$f":"'１ー①選択リスト一覧'!C10","v":"弓道"}]
[6,null,null,null,null,null,null,null,null,null,null,null,{"$f":"'１ー①選択リスト一覧'!B11","v":"B"},{"$f":"'１ー①選択リスト一覧'!C11","v":"柔道"}]
[7,null,null,null,null,null,null,null,null,null,null,null,{"$f":"'１ー①選択リスト一覧'!B12","v":"C"},{"$f":"'１ー①選択リスト一覧'!C12","v":"剣道"}]
[8,null,null,null,null,null,null,null,null,null,null,null,{"$f":"'１ー①選択リスト一覧'!B13","v":"D"},{"$f":"'１ー①選択リスト一覧'!C13","v":"卓球"}]
[9,null,null,null,null,null,null,null,null,null,null,null,{"$f":"'１ー①選択リスト一覧'!B14","v":"E"},{"$f":"'１ー①選択リスト一覧'!C14","v":"男子バレー"}]
[10,null,null,null,null,null,null,null,null,null,null,null,{"$f":"'１ー①選択リスト一覧'!B15","v":"F"},{"$f":"'１ー①選択リスト一覧'!C15","v":"バドミントン"}]
[11,null,null,null,null,null,null,null,null,null,null,null,{"$f":"'１ー①選択リスト一覧'!B16","v":"G"},{"$f":"'１ー①選択リスト一覧'!C16","v":"サッカー"}]
[12,null,null,null,null,null,null,null,null,null,null,null,{"$f":"'１ー①選択リスト一覧'!B17","v":"H"},{"$f":"'１ー①選択リスト一覧'!C17","v":"野球"}]
[13,null,null,null,null,null,null,null,null,null,null,null,{"$f":"'１ー①選択リスト一覧'!B18","v":"I"},{"$f":"'１ー①選択リスト一覧'!C18","v":"陸上"}]
[14,null,null,null,null,null,null,null,null,null,null,null,{"$f":"'１ー①選択リスト一覧'!B19","v":"J"},{"$f":"'１ー①選択リスト一覧'!C19","v":"サイエンスアクア"}]
[15,null,null,null,null,null,null,null,null,null,null,null,{"$f":"'１ー①選択リスト一覧'!B20","v":"k"},{"$f":"'１ー①選択リスト一覧'!C20","v":"ラーメン同好会"}]
[16]
[17]
[18]
[19]
[20]
[21]
[22]
[23]
[24]
[25]
[26]
[27]
[28]
[29]
[30]
[]
[]
[null,"こちらのエクセルデータをメールしてください。",null,null,null,null,null,"申込締切",null,"７月４日（金）"]
[null,null,null,null,null,null,null,"ＦＡＸ番号","０９９３－７６－２１１２"]
[null,null,null,null,null,null,null,"Ｍａｉｌ","sakasegawa-manabu@kago.ed.jp"]
[null,null,null,null,null,null,null,"担　当","教務部　逆瀨川　学"]

{"sheet":"依頼書","index":3,"n_rows":34,"n_cols":15,"rows_kept":34,"cut":false,"hidden":false,"merged":[[0,11,0,14],[1,9,1,10],[13,1,13,14],[5,9,5,14],[7,9,7,14]]}
[null,null,null,null,null,null,null,null,null,null,null,"(一日体験入学)様式３"]
[null,null,null,null,null,null,null,null,null,"令和7年",null,null,"月",null,"日"]
[]
["鹿児島県立鹿児島水産高等学校長　　殿"]
[]
[null,null,null,null,null,null,null,"校　名"]
[]
[null,null,null,null,null,null,null,"校　長"]
[null,null,null,null,null,null,null,null,"　","（　公　印　省　略　）　"]
[]
[]
["鹿児島水産高等学校一日体験入学における指導について（依頼）"]
[]
[null,"　このことについて，貴校での一日体験入学におきましては，諸事情により本校職員の引率及び巡回指導を実施できませんので，様式２の生徒の指導を依頼いたします。"]
[]
[]
[]
[]
[]
[]
[]
[]
[]
[]
[]
[]
[]
[]
[]
[]
[null,null,null,null,null,null,null,"申込締切",null,null,"７月４日（金）"]
[null,null,null,null,null,null,null,"ＦＡＸ番号",null,null,"０９９３－７６－２１１２"]
[null,null,null,null,null,null,null,"Ｍａｉｌ",null,null,"sakasegawa-manabu@kago.ed.jp"]
[null,null,null,null,null,null,"　　","担　当",null,null,"教務部　逆瀨川　学"]